Tangible Object
type: Class
comment: An object that visibly takes up space, for example, a human body.
subclass of: Object
disjoint with: Teaching
disjoint with: ThroneRoom
disjoint with: Topic
disjoint with: TransferToInstitution
disjoint with: TransferToPerson
disjoint with: Unit
disjoint with: UnrealisedEvent
disjoint with: UsingTheTelephone
disjoint with: VisitOrStay
disjoint with: War
disjoint with: Workplace
disjoint with: TravelEvent
disjoint with: UnrealisedRole
disjoint with: WeatherEvent