Role
type: Class
comment: A perdurant object, which lasts for the duration of an event.
subclass of: perdurant
disjoint with: Room
disjoint with: SatisfactionInterestEnjoyment
disjoint with: Scarf
disjoint with: Sceptre
disjoint with: Sculpting
disjoint with: Sculpture
disjoint with: Seated
disjoint with: Set
disjoint with: SheetMusic
disjoint with: SignedObject
disjoint with: Sketchbook
disjoint with: Smoking
disjoint with: SocialEvent
disjoint with: SocioEconomicDescriptor
disjoint with: SourceFormat
disjoint with: Space
disjoint with: Standing
disjoint with: State
disjoint with: Stick
disjoint with: Stool
disjoint with: Street
disjoint with: SubjectiveEvent
disjoint with: Suit
disjoint with: SumOfMoney
disjoint with: Teaching
disjoint with: Tiara
disjoint with: Topic
disjoint with: TownOrVillage
disjoint with: TransferToInstitution
disjoint with: TransferToPerson
disjoint with: Trousers
disjoint with: Unit
disjoint with: UnrealisedEvent
disjoint with: UsingTheTelephone
disjoint with: VisitOrStay
disjoint with: War
disjoint with: SocialInformationObject
disjoint with: TangibleObject
disjoint with: TravelEvent
disjoint with: ValuableObject
disjoint with: WeatherEvent
disjoint with: WritingImplement
disjoint with: Suggestion