Object
type: Class
comment: An endurant object. It may be actual and tangible, such as a painting, or abstract and intangible, such as a socio-economic group.
subclass of: endurant
disjoint with: Observer
disjoint with: Opinion
disjoint with: PaintingActivity
disjoint with: PlayingAnInstrument
disjoint with: Pointing
disjoint with: PoliticalEvent
disjoint with: PortraitCommission
disjoint with: PortraitConstruction
disjoint with: PortraitDestruction
disjoint with: PortraitDisplay
disjoint with: PortraitMeeting
disjoint with: PortraitPitch
disjoint with: PortraitPresentation
disjoint with: PortraitProduction
disjoint with: PortraitReception
disjoint with: PortraitReproduction
disjoint with: PortraitReview
disjoint with: PortraitSitting
disjoint with: PortraitSittingProper
disjoint with: PoseInEvent
disjoint with: PoseInPicture
disjoint with: PotentialRole
disjoint with: Presentation
disjoint with: Product
disjoint with: Production
disjoint with: PropInEvent
disjoint with: PropInPicture
disjoint with: Purpose
disjoint with: ReceptionRoom
disjoint with: Recipient
disjoint with: Reviewer
disjoint with: Role
disjoint with: Schedule
disjoint with: Sculpting
disjoint with: Seated
disjoint with: Sitter
disjoint with: Smoking
disjoint with: SocialEvent
disjoint with: Standing
disjoint with: State
disjoint with: Studio
disjoint with: SubjectInPicture
disjoint with: SubjectiveEvent
disjoint with: Supplier
disjoint with: Support
disjoint with: Teaching
disjoint with: ThroneRoom
disjoint with: TransferToInstitution
disjoint with: TransferToPerson
disjoint with: UnrealisedEvent
disjoint with: UsingTheTelephone
disjoint with: VisitOrStay
disjoint with: War
disjoint with: Workplace
disjoint with: ObjectRole
disjoint with: Occasion
disjoint with: Palace
disjoint with: PersonRole
disjoint with: PortraitAcquisition
disjoint with: PortraitEvent
disjoint with: PortraitInception
disjoint with: PortraitProductionRole
disjoint with: Pose
disjoint with: PositiveFeeling
disjoint with: PositiveOpinion
disjoint with: PositiveReception
disjoint with: Prop
disjoint with: PurchaseEvent
disjoint with: PurchaseRole
disjoint with: RealisedEvent
disjoint with: RealisedRole
disjoint with: ReceivingTreatment
disjoint with: Seller
disjoint with: Shop
disjoint with: TravelEvent
disjoint with: UnrealisedRole