Intangible Object
type: Class
comment: An object that does not visibly take up space, for example, a thought.
subclass of: Object
disjoint with: Internal
disjoint with: Jacket
disjoint with: Jewellery
disjoint with: Journey
disjoint with: Jubilee
disjoint with: KnighthoodEvent
disjoint with: Lamp
disjoint with: LectureTheatre
disjoint with: LiteraryEvent
disjoint with: LoanEvent
disjoint with: Location
disjoint with: LocationInEvent
disjoint with: LocationInPicture
disjoint with: LogisticalFactor
disjoint with: Maker
disjoint with: Manuscript
disjoint with: Map
disjoint with: MayoralRobes
disjoint with: Medal
disjoint with: Mediator
disjoint with: MilitaryUniform
disjoint with: Model
disjoint with: MusicEvent
disjoint with: NegativeOpinion
disjoint with: Observer
disjoint with: Opinion
disjoint with: OutdoorSpace
disjoint with: Painting
disjoint with: PaintingActivity
disjoint with: Photograph
disjoint with: Piano
disjoint with: PlayingAnInstrument
disjoint with: Pointing
disjoint with: PoliticalEvent
disjoint with: PortraitCommission
disjoint with: PortraitConstruction
disjoint with: PortraitDestruction
disjoint with: PortraitDisplay
disjoint with: PortraitMeeting
disjoint with: PortraitObject
disjoint with: PortraitPitch
disjoint with: PortraitPresentation
disjoint with: PortraitProduction
disjoint with: PortraitReception
disjoint with: PortraitReproduction
disjoint with: PortraitReview
disjoint with: PortraitSitting
disjoint with: PortraitSittingProper
disjoint with: PoseInEvent
disjoint with: PoseInPicture
disjoint with: PotentialRole
disjoint with: PreciousMetal
disjoint with: Presentation
disjoint with: PresentationPortrait
disjoint with: Print
disjoint with: Product
disjoint with: Production
disjoint with: PropInEvent
disjoint with: PropInPicture
disjoint with: Purpose
disjoint with: ReceptionRoom
disjoint with: Recipient
disjoint with: Reviewer
disjoint with: Role
disjoint with: Room
disjoint with: Scarf
disjoint with: Sceptre
disjoint with: Schedule
disjoint with: Sculpting
disjoint with: Sculpture
disjoint with: Seated
disjoint with: Set
disjoint with: SheetMusic
disjoint with: SignedObject
disjoint with: Sitter
disjoint with: Sketchbook