Information Object
disjoint with: TownOrVillage
disjoint with: TransferToInstitution
disjoint with: TransferToPerson
disjoint with: Trousers
disjoint with: UnrealisedEvent
disjoint with: UsingTheTelephone
disjoint with: VisitOrStay
disjoint with: War
disjoint with: Workplace
disjoint with: Instrument
disjoint with: LiteraryObject
disjoint with: LoanRole
disjoint with: MusicObject
disjoint with: NegativeFeeling
disjoint with: NegativeReception
disjoint with: NonEssentialRole
disjoint with: ObjectRole
disjoint with: Occasion
disjoint with: Outbuilding
disjoint with: Palace
disjoint with: PersonalObject
disjoint with: PersonRole
disjoint with: PortraitAcquisition
disjoint with: PortraitEvent
disjoint with: PortraitInception
disjoint with: PortraitProductionRole
disjoint with: Pose
disjoint with: PositiveFeeling
disjoint with: PositiveOpinion
disjoint with: PositiveReception
disjoint with: Prop
disjoint with: PurchaseEvent
disjoint with: PurchaseRole
disjoint with: RealisedEvent
disjoint with: RealisedRole
disjoint with: ReceivingTreatment
disjoint with: Seller
disjoint with: Shop
disjoint with: TangibleObject
disjoint with: TravelEvent
disjoint with: UnrealisedRole
disjoint with: ValuableObject
disjoint with: WeatherEvent
disjoint with: WritingImplement
disjoint with: Lender
disjoint with: Subject
disjoint with: Suggestion
type: Class
comment: An abstract object that exists to make sense of other objects that exist in the world, for example, by categorising them.
subclass of: IntangibleObject
disjoint with: Initiator
disjoint with: Injury
disjoint with: Internal
disjoint with: Jacket
disjoint with: Jewellery
disjoint with: Journey
disjoint with: Jubilee
disjoint with: KnighthoodEvent
disjoint with: Lamp
disjoint with: LectureTheatre
disjoint with: LiteraryEvent
disjoint with: LoanEvent
disjoint with: Location
disjoint with: LocationInEvent
disjoint with: LocationInPicture
disjoint with: LogisticalFactor
disjoint with: Maker
disjoint with: Manuscript
disjoint with: Map
disjoint with: MayoralRobes
disjoint with: Medal
disjoint with: Mediator
disjoint with: MilitaryUniform
disjoint with: Model
disjoint with: MusicEvent
disjoint with: NegativeOpinion
disjoint with: Observer
disjoint with: Opinion
disjoint with: OutdoorSpace