Factor
disjoint with: State
disjoint with: Stick
disjoint with: Stool
disjoint with: Street
disjoint with: SubjectiveEvent
disjoint with: Suit
disjoint with: SumOfMoney
disjoint with: Teaching
disjoint with: Tiara
disjoint with: Topic
disjoint with: TownOrVillage
disjoint with: TransferToInstitution
disjoint with: TransferToPerson
disjoint with: Trousers
disjoint with: Unit
disjoint with: UnrealisedEvent
disjoint with: UsingTheTelephone
disjoint with: VisitOrStay
disjoint with: War
disjoint with: FinancialEvent
disjoint with: FormatSize
disjoint with: Furniture
disjoint with: Headwear
disjoint with: InformationObject
disjoint with: Instrument
disjoint with: IntangibleObject
disjoint with: LiteraryObject
disjoint with: Memorandum
disjoint with: MusicObject
disjoint with: NegativeFeeling
disjoint with: NegativeReception
disjoint with: Occasion
disjoint with: Outbuilding
disjoint with: PersonalObject
disjoint with: PortraitAcquisition
disjoint with: PortraitEvent
disjoint with: PortraitInception
disjoint with: PositiveFeeling
disjoint with: PositiveOpinion
disjoint with: PositiveReception
disjoint with: PurchaseEvent
disjoint with: RealisedEvent
disjoint with: ReceivingTreatment
disjoint with: SocialInformationObject
disjoint with: TangibleObject
disjoint with: TravelEvent
disjoint with: ValuableObject
disjoint with: WeatherEvent
disjoint with: WritingImplement
disjoint with: GiftEvent
disjoint with: Suggestion
type: Class
comment: An aspect of portrait production, about which decisions are made.
subclass of: PortraitProductionRole
disjoint with: Feeling
disjoint with: Fidgeting
disjoint with: FinishedState
disjoint with: FlatteryCooperationService
disjoint with: FoodOrDrink
disjoint with: FormatFigure
disjoint with: FriendshipEvent
disjoint with: FundOrBequest
disjoint with: GarterRobes
disjoint with: GazeDown
disjoint with: GazeUp
disjoint with: GenderIdentity
disjoint with: Gloves
disjoint with: Hairband
disjoint with: Hat
disjoint with: HealthEvent
disjoint with: HospitalitySocialHarmonyEntertainment
disjoint with: Illness
disjoint with: InformationIdeas
disjoint with: Injury
disjoint with: Internal
disjoint with: InterviewTranscript
disjoint with: Jacket
disjoint with: Jewellery
disjoint with: Journey