Factor
type: Class
comment: An aspect of portrait production, about which decisions are made.
subclass of: PortraitProductionRole
disjoint with: Feeling
disjoint with: Fidgeting
disjoint with: FinishedState
disjoint with: FlatteryCooperationService
disjoint with: FoodOrDrink
disjoint with: FormatFigure
disjoint with: FriendshipEvent
disjoint with: FundOrBequest
disjoint with: GarterRobes
disjoint with: GazeDown
disjoint with: GazeUp
disjoint with: GenderIdentity
disjoint with: Gloves
disjoint with: Hairband
disjoint with: Hat
disjoint with: HealthEvent
disjoint with: HospitalitySocialHarmonyEntertainment
disjoint with: Illness
disjoint with: InformationIdeas
disjoint with: Injury
disjoint with: Internal
disjoint with: InterviewTranscript
disjoint with: Jacket
disjoint with: Jewellery
disjoint with: Journey
disjoint with: Jubilee
disjoint with: KnighthoodEvent
disjoint with: Lamp
disjoint with: Letter
disjoint with: LiteraryEvent
disjoint with: LiteraryWork
disjoint with: LoanEvent
disjoint with: Manuscript
disjoint with: Map
disjoint with: MarkMakingStyle
disjoint with: MayoralRobes
disjoint with: Medal
disjoint with: Medium
disjoint with: MilitaryUniform
disjoint with: MusicEvent
disjoint with: NegativeOpinion
disjoint with: Object
disjoint with: Occupation
disjoint with: OffenceDissatisfactionDiscomfort
disjoint with: Opinion
disjoint with: Organisation
disjoint with: OutdoorSpace
disjoint with: Painting
disjoint with: PaintingActivity
disjoint with: Person
disjoint with: PersonGroup
disjoint with: Photograph
disjoint with: Piano
disjoint with: PlayingAnInstrument
disjoint with: Pointing
disjoint with: PoliticalEvent
disjoint with: PortraitCommission
disjoint with: PortraitConstruction
disjoint with: PortraitDestruction
disjoint with: PortraitDisplay
disjoint with: PortraitMeeting
disjoint with: PortraitObject
disjoint with: PortraitPitch
disjoint with: PortraitPresentation
disjoint with: PortraitProduction
disjoint with: PortraitReception
disjoint with: PortraitReproduction
disjoint with: PortraitReview
disjoint with: PortraitSitting
disjoint with: PortraitSittingAccount
disjoint with: PortraitSittingProper
disjoint with: PortraitSittingRecord
disjoint with: PreciousMetal
disjoint with: Presentation
disjoint with: PresentationPortrait
disjoint with: PressArticle