Exchange
type: Class
comment: An event in which a commodity is given and, or received.
subclass of: Event
disjoint with: Exemplar
disjoint with: FinishedState
disjoint with: FlatteryCooperationService
disjoint with: FoodOrDrink
disjoint with: FormatFigure
disjoint with: FormatOrSize
disjoint with: Funder
disjoint with: FundOrBequest
disjoint with: GarterRobes
disjoint with: GenderIdentity
disjoint with: Giver
disjoint with: Gloves
disjoint with: Hairband
disjoint with: Hat
disjoint with: HomeOrHotel
disjoint with: Hospital
disjoint with: HospitalitySocialHarmonyEntertainment
disjoint with: InformationIdeas
disjoint with: Initiator
disjoint with: InterviewTranscript
disjoint with: Jacket
disjoint with: Jewellery
disjoint with: Lamp
disjoint with: LectureTheatre
disjoint with: Letter
disjoint with: LiteraryWork
disjoint with: Location
disjoint with: LocationInEvent
disjoint with: LocationInPicture
disjoint with: LogisticalFactor
disjoint with: Maker
disjoint with: Manuscript
disjoint with: Map
disjoint with: MarkMakingStyle
disjoint with: MayoralRobes
disjoint with: Medal
disjoint with: Mediator
disjoint with: Medium
disjoint with: MilitaryUniform
disjoint with: Model
disjoint with: Object
disjoint with: Observer
disjoint with: Occupation
disjoint with: OffenceDissatisfactionDiscomfort
disjoint with: Organisation
disjoint with: OutdoorSpace
disjoint with: Painting
disjoint with: Person
disjoint with: PersonGroup
disjoint with: Photograph
disjoint with: Piano
disjoint with: PortraitObject
disjoint with: PortraitSittingAccount
disjoint with: PortraitSittingRecord
disjoint with: PoseInEvent
disjoint with: PoseInPicture
disjoint with: PotentialRole
disjoint with: PreciousMetal
disjoint with: PresentationPortrait
disjoint with: PressArticle
disjoint with: Print
disjoint with: Product
disjoint with: PropInEvent
disjoint with: PropInPicture
disjoint with: PublicationStatus
disjoint with: Purpose
disjoint with: ReceptionRoom
disjoint with: Recipient
disjoint with: Reviewer
disjoint with: Role
disjoint with: Room
disjoint with: SatisfactionInterestEnjoyment
disjoint with: Scarf
disjoint with: Sceptre
disjoint with: Schedule
disjoint with: Sculpture