Event
disjoint with: TownOrVillage
disjoint with: Trousers
disjoint with: Unit
disjoint with: Workplace
disjoint with: EventRole
disjoint with: Factor
disjoint with: FormatSize
disjoint with: Furniture
disjoint with: GiftRecipient
disjoint with: GiftRole
disjoint with: GivenRole
disjoint with: Headwear
disjoint with: InformationObject
disjoint with: Instrument
disjoint with: IntangibleObject
disjoint with: LiteraryObject
disjoint with: LoanRole
disjoint with: Memorandum
disjoint with: MusicObject
disjoint with: NonEssentialRole
disjoint with: ObjectRole
disjoint with: Outbuilding
disjoint with: Palace
disjoint with: PersonalObject
disjoint with: PersonRole
disjoint with: PortraitProductionRole
disjoint with: Pose
disjoint with: Prop
disjoint with: PurchaseRole
disjoint with: RealisedRole
disjoint with: Seller
disjoint with: Shop
disjoint with: SocialInformationObject
disjoint with: TangibleObject
disjoint with: UnrealisedRole
disjoint with: ValuableObject
disjoint with: WritingImplement
disjoint with: GiftGiver
disjoint with: GroupSubject
disjoint with: Host
disjoint with: IndividualSubject
disjoint with: Lender
disjoint with: Subject
type: Class
comment: Something that happens in space and time.
subclass of: perdurant
disjoint with: Exemplar
disjoint with: FinishedState
disjoint with: FlatteryCooperationService
disjoint with: FoodOrDrink
disjoint with: FormatFigure
disjoint with: FormatOrSize
disjoint with: Funder
disjoint with: FundOrBequest
disjoint with: GarterRobes
disjoint with: GenderIdentity
disjoint with: Giver
disjoint with: Gloves
disjoint with: Hairband
disjoint with: Hat
disjoint with: HomeOrHotel
disjoint with: Hospital
disjoint with: HospitalitySocialHarmonyEntertainment
disjoint with: InformationIdeas
disjoint with: Initiator
disjoint with: InterviewTranscript
disjoint with: Jacket
disjoint with: Jewellery
disjoint with: Lamp
disjoint with: LectureTheatre
disjoint with: Letter
disjoint with: LiteraryWork
disjoint with: Location
disjoint with: LocationInEvent
disjoint with: LocationInPicture
disjoint with: LogisticalFactor
disjoint with: Maker
disjoint with: Manuscript
disjoint with: Map