Agent Role
type: Class
comment: A role that is played by an agent. (The perdurant agent.)
subclass of: ObjectRole
disjoint with: Agreement
disjoint with: AnticipatedEvent
disjoint with: Apparel
disjoint with: ArchitecturalModel
disjoint with: ArmsClosed
disjoint with: ArtEvent
disjoint with: ArtObject
disjoint with: Autobiography
disjoint with: Baton
disjoint with: Biography
disjoint with: Birthday
disjoint with: Book
disjoint with: Building
disjoint with: BusinessEvent
disjoint with: BusinessOpportunityExposure
disjoint with: Bust
disjoint with: CatalogueEntry
disjoint with: Cello
disjoint with: Ceramic
disjoint with: CeremonialDress
disjoint with: Chalk
disjoint with: CigaretteOrCigar
disjoint with: City
disjoint with: Coat
disjoint with: Collection
disjoint with: ColourPalette
disjoint with: Composing
disjoint with: ConditionState
disjoint with: Conducting
disjoint with: Conversation
disjoint with: Coronation
disjoint with: CoronationDress
disjoint with: Country
disjoint with: County
disjoint with: CreativeWorkIntellectualPropertyRights
disjoint with: Crown
disjoint with: Death
disjoint with: DegreeOfRemove
disjoint with: Desire
disjoint with: Destruction
disjoint with: DiaryEntry
disjoint with: DictatingLetters
disjoint with: Disagreement
disjoint with: Dog
disjoint with: Drawing
disjoint with: Dress
disjoint with: DrinkOrMealEvent
disjoint with: Easel
disjoint with: Engagement
disjoint with: Event
disjoint with: Exchange
disjoint with: External
disjoint with: Feeling
disjoint with: Fidgeting
disjoint with: FinishedState
disjoint with: FlatteryCooperationService
disjoint with: FoodOrDrink
disjoint with: FormatFigure
disjoint with: FriendshipEvent
disjoint with: FundOrBequest
disjoint with: GarterRobes
disjoint with: GazeDown
disjoint with: GazeUp
disjoint with: GenderIdentity
disjoint with: Gloves
disjoint with: Hairband
disjoint with: Hat
disjoint with: HealthEvent
disjoint with: HospitalitySocialHarmonyEntertainment
disjoint with: Illness
disjoint with: InformationIdeas
disjoint with: Injury
disjoint with: Internal
disjoint with: InterviewTranscript
disjoint with: Jacket
disjoint with: Jewellery