Agent
type: Class
comment: An entity that makes meaningful decisions. The term refers to the decision-making capacity as opposed to its physical manifestation, for example, the mind as opposed to the body.
subclass of: IntangibleObject
disjoint with: AgentRole
disjoint with: Agreement
disjoint with: AnticipatedEvent
disjoint with: Apparel
disjoint with: ArchitecturalModel
disjoint with: ArmsClosed
disjoint with: ArtEvent
disjoint with: Artist
disjoint with: ArtObject
disjoint with: Author
disjoint with: Baton
disjoint with: Birthday
disjoint with: Book
disjoint with: Building
disjoint with: BusinessEvent
disjoint with: Bust
disjoint with: CafeRestaurantPub
disjoint with: Cello
disjoint with: Ceramic
disjoint with: CeremonialDress
disjoint with: Chalk
disjoint with: CigaretteOrCigar
disjoint with: City
disjoint with: Coat
disjoint with: Collection
disjoint with: Commodity
disjoint with: Composing
disjoint with: Conducting
disjoint with: Conversation
disjoint with: Coronation
disjoint with: CoronationDress
disjoint with: Cost
disjoint with: CostumeInEvent
disjoint with: CostumeInPicture
disjoint with: Country
disjoint with: County
disjoint with: Crown
disjoint with: Death
disjoint with: DecisionMaker
disjoint with: DesignFactor
disjoint with: Desire
disjoint with: Destruction
disjoint with: DictatingLetters
disjoint with: Disagreement
disjoint with: Dog
disjoint with: Drawing
disjoint with: DrawingRoom
disjoint with: Dress
disjoint with: DrinkOrMealEvent
disjoint with: Easel
disjoint with: Engagement
disjoint with: Event
disjoint with: Exchange
disjoint with: Exemplar
disjoint with: External
disjoint with: Feeling
disjoint with: Fidgeting
disjoint with: FoodOrDrink
disjoint with: FormatOrSize
disjoint with: FriendshipEvent
disjoint with: Funder
disjoint with: GarterRobes
disjoint with: GazeDown
disjoint with: GazeUp
disjoint with: Giver
disjoint with: Gloves
disjoint with: Hairband
disjoint with: Hat
disjoint with: HealthEvent
disjoint with: HomeOrHotel
disjoint with: Hospital
disjoint with: Illness
disjoint with: Initiator
disjoint with: Injury
disjoint with: Internal
disjoint with: Jacket